{"text_format":"1","workbook":"xlsx","n_sheets":5,"sheets":["Income","Outgoings","Dashboard","Data","Help"],"not_rendered":{"charts":4,"images":1,"macros":1,"external_links":1,"defined_names":8,"comments":0,"pivot_tables":4},"unopened":[],"bounds":{"document_bytes":16777216,"sheet_cells":100000,"rows_first":2000,"rows_last":500,"rows_between":2000,"halvings":0,"cell_chars":16384,"cell_head_chars":4096},"cells_cut":0,"cells_raw":0,"read":"whole","date_system":"1900"}

{"sheet":"Income","index":0,"n_rows":651,"n_cols":123,"rows_kept":651,"cut":false,"hidden":false,"merged":[[649,1,650,1],[634,1,635,1],[637,1,638,1],[640,1,641,1],[643,1,644,1],[646,1,647,1],[619,1,620,1],[622,1,623,1],[625,1,626,1],[628,1,629,1],[631,1,632,1],[604,1,605,1],[607,1,608,1],[610,1,611,1],[613,1,614,1],[616,1,617,1],[589,1,590,1],[592,1,593,1],[595,1,596,1],[598,1,599,1],[601,1,602,1],[574,1,575,1],[577,1,578,1],[580,1,581,1],[583,1,584,1],[586,1,587,1],[559,1,560,1],[562,1,563,1],[565,1,566,1],[568,1,569,1],[571,1,572,1],[544,1,545,1],[547,1,548,1],[550,1,551,1],[553,1,554,1],[556,1,557,1],[529,1,530,1],[532,1,533,1],[535,1,536,1],[538,1,539,1],[541,1,542,1],[514,1,515,1],[517,1,518,1],[520,1,521,1],[523,1,524,1],[526,1,527,1],[499,1,500,1],[502,1,503,1],[505,1,506,1],[508,1,509,1],[511,1,512,1],[484,1,485,1],[487,1,488,1],[490,1,491,1],[493,1,494,1],[496,1,497,1],[469,1,470,1],[472,1,473,1],[475,1,476,1],[478,1,479,1],[481,1,482,1],[454,1,455,1],[457,1,458,1],[460,1,461,1],[463,1,464,1],[466,1,467,1],[439,1,440,1],[442,1,443,1],[445,1,446,1],[448,1,449,1],[451,1,452,1],[424,1,425,1],[427,1,428,1],[430,1,431,1],[433,1,434,1],[436,1,437,1],[409,1,410,1],[412,1,413,1],[415,1,416,1],[418,1,419,1],[421,1,422,1],[394,1,395,1],[397,1,398,1],[400,1,401,1],[403,1,404,1],[406,1,407,1],[379,1,380,1],[382,1,383,1],[385,1,386,1],[388,1,389,1],[391,1,392,1],[364,1,365,1],[367,1,368,1],[370,1,371,1],[373,1,374,1],[376,1,377,1],[349,1,350,1],[352,1,353,1],[355,1,356,1],[358,1,359,1],[361,1,362,1],[334,1,335,1],[337,1,338,1],[340,1,341,1],[343,1,344,1],[346,1,347,1],[319,1,320,1],[322,1,323,1],[325,1,326,1],[328,1,329,1],[331,1,332,1],[304,1,305,1],[307,1,308,1],[310,1,311,1],[313,1,314,1],[316,1,317,1],[289,1,290,1],[292,1,293,1],[295,1,296,1],[298,1,299,1],[301,1,302,1],[274,1,275,1],[277,1,278,1],[280,1,281,1],[283,1,284,1],[286,1,287,1],[259,1,260,1],[262,1,263,1],[265,1,266,1],[268,1,269,1],[271,1,272,1],[244,1,245,1],[247,1,248,1],[250,1,251,1],[253,1,254,1],[256,1,257,1],[229,1,230,1],[232,1,233,1],[235,1,236,1],[238,1,239,1],[241,1,242,1],[214,1,215,1],[217,1,218,1],[220,1,221,1],[223,1,224,1],[226,1,227,1],[22,1,23,1],[202,1,203,1],[205,1,206,1],[208,1,209,1],[211,1,212,1],[73,1,74,1],[79,1,80,1],[64,1,65,1],[70,1,71,1],[61,1,62,1],[67,1,68,1],[88,1,89,1],[94,1,95,1],[85,1,86,1],[91,1,92,1],[76,1,77,1],[82,1,83,1],[133,1,134,1],[97,1,98,1],[7,1,8,1],[10,1,11,1],[13,1,14,1],[16,1,17,1],[19,1,20,1],[52,1,53,1],[58,1,59,1],[55,1,56,1],[40,1,41,1],[46,1,47,1],[25,1,26,1],[31,1,32,1],[37,1,38,1],[43,1,44,1],[49,1,50,1],[28,1,29,1],[34,1,35,1],[151,1,152,1],[103,1,104,1],[106,1,107,1],[109,1,110,1],[112,1,113,1],[115,1,116,1],[100,1,101,1],[118,1,119,1],[121,1,122,1],[124,1,125,1],[190,1,191,1],[193,1,194,1],[196,1,197,1],[199,1,200,1],[5,1,6,1],[172,1,173,1],[175,1,176,1],[178,1,179,1],[181,1,182,1],[184,1,185,1],[187,1,188,1],[154,1,155,1],[157,1,158,1],[160,1,161,1],[163,1,164,1],[166,1,167,1],[127,1,128,1],[130,1,131,1],[169,1,170,1],[136,1,137,1],[139,1,140,1],[142,1,143,1],[145,1,146,1],[148,1,149,1]]}
[null,"Income"]
[null,{"$f":"NOW()","v":"2019-03-13T17:29:37.120"},null,{"$f":"B4","v":"2019-01-01"},{"$f":"DATE(YEAR(D2),MONTH(D2)+1,DAY(D2))","v":"2019-02-01"},{"$f":"DATE(YEAR(E2),MONTH(E2)+1,DAY(E2))","v":"2019-03-01"},"2019-04-01","2019-05-01","2019-06-01","2019-07-01","2019-08-01","2019-09-01","2019-10-01","2019-11-01","2019-12-01","2020-01-01","2020-02-01","2020-03-01","2020-04-01","2020-05-01","2020-06-01","2020-07-01","2020-08-01","2020-09-01","2020-10-01","2020-11-01","2020-12-01","2021-01-01","2021-02-01","2021-03-01","2021-04-01","2021-05-01","2021-06-01","2021-07-01","2021-08-01","2021-09-01","2021-10-01","2021-11-01","2021-12-01","2022-01-01","2022-02-01","2022-03-01","2022-04-01","2022-05-01","2022-06-01","2022-07-01","2022-08-01","2022-09-01","2022-10-01","2022-11-01","2022-12-01","2023-01-01","2023-02-01","2023-03-01","2023-04-01","2023-05-01","2023-06-01","2023-07-01","2023-08-01","2023-09-01","2023-10-01","2023-11-01","2023-12-01","2024-01-01","2024-02-01","2024-03-01","2024-04-01","2024-05-01","2024-06-01",{"$f":"DATE(YEAR(BQ2),MONTH(BQ2)+1,DAY(BQ2))","v":"2024-07-01"},"2024-08-01","2024-09-01","2024-10-01","2024-11-01","2024-12-01","2025-01-01","2025-02-01","2025-03-01","2025-04-01","2025-05-01","2025-06-01","2025-07-01","2025-08-01","2025-09-01","2025-10-01","2025-11-01","2025-12-01","2026-01-01","2026-02-01","2026-03-01","2026-04-01","2026-05-01","2026-06-01","2026-07-01","2026-08-01","2026-09-01","2026-10-01","2026-11-01","2026-12-01","2027-01-01","2027-02-01","2027-03-01","2027-04-01","2027-05-01","2027-06-01","2027-07-01","2027-08-01","2027-09-01","2027-10-01","2027-11-01","2027-12-01","2028-01-01","2028-02-01","2028-03-01","2028-04-01","2028-05-01","2028-06-01","2028-07-01","2028-08-01","2028-09-01","2028-10-01","2028-11-01","2028-12-01"]
[null,"Starting Date",null,{"$f":"TEXT(D2,\"mmm yy\")","v":"Jan 19"},{"$f":"TEXT(E2,\"mmm yy\")","v":"Feb 19"},{"$f":"TEXT(F2,\"mmm yy\")","v":"Mar 19"},"Apr 19","May 19","Jun 19","Jul 19","Aug 19","Sep 19","Oct 19","Nov 19","Dec 19","Jan 20","Feb 20","Mar 20","Apr 20","May 20","Jun 20","Jul 20","Aug 20","Sep 20","Oct 20","Nov 20","Dec 20","Jan 21","Feb 21","Mar 21","Apr 21","May 21","Jun 21","Jul 21","Aug 21","Sep 21","Oct 21","Nov 21","Dec 21","Jan 22","Feb 22","Mar 22","Apr 22","May 22","Jun 22","Jul 22","Aug 22","Sep 22","Oct 22","Nov 22","Dec 22","Jan 23","Feb 23","Mar 23","Apr 23","May 23","Jun 23","Jul 23","Aug 23","Sep 23","Oct 23","Nov 23","Dec 23","Jan 24","Feb 24","Mar 24","Apr 24","May 24","Jun 24",{"$f":"TEXT(BR2,\"mmm yy\")","v":"Jul 24"},"Aug 24","Sep 24","Oct 24","Nov 24","Dec 24","Jan 25","Feb 25","Mar 25","Apr 25","May 25","Jun 25","Jul 25","Aug 25","Sep 25","Oct 25","Nov 25","Dec 25","Jan 26","Feb 26","Mar 26","Apr 26","May 26","Jun 26","Jul 26","Aug 26","Sep 26","Oct 26","Nov 26","Dec 26","Jan 27","Feb 27","Mar 27","Apr 27","May 27","Jun 27","Jul 27","Aug 27","Sep 27","Oct 27","Nov 27","Dec 27","Jan 28","Feb 28","Mar 28","Apr 28","May 28","Jun 28","Jul 28","Aug 28","Sep 28","Oct 28","Nov 28","Dec 28"]
[null,"2019-01-01","Plan",{"$f":"SUMIF($C$8:$C$9441,$C4,D$8:D$9441)","v":3545.34},3545.34,3545.34,3745.34,3545.34,3545.34,3545.34,3545.34,3545.34,3545.34,{"$f":"SUMIF($C$8:$C$9441,$C4,N$8:N$9441)","v":3545.34},3545.34,0,0,0,0,0,0,0,0,{"$f":"SUMIF($C$8:$C$9441,$C4,X$8:X$9441)","v":0},0,0,0,0,0,0,0,0,0,{"$f":"SUMIF($C$8:$C$9441,$C4,AH$8:AH$9441)","v":0},0,0,0,0,0,0,0,0,0,{"$f":"SUMIF($C$8:$C$9441,$C4,AR$8:AR$9441)","v":0},0,0,0,0,0,0,0,0,0,{"$f":"SUMIF($C$8:$C$9441,$C4,BB$8:BB$9441)","v":0},0,0,0,0,0,0,0,0,0,{"$f":"SUMIF($C$8:$C$9441,$C4,BL$8:BL$9441)","v":0},0,0,0,0,0,0,0,0,0,{"$f":"SUMIF($C$8:$C$9441,$C4,BV$8:BV$9441)","v":0},0,0,0,0,0,0,0,0,0,{"$f":"SUMIF($C$8:$C$9441,$C4,CF$8:CF$9441)","v":0},0,0,0,0,0,0,0,0,0,{"$f":"SUMIF($C$8:$C$9441,$C4,CP$8:CP$9441)","v":0},0,0,0,0,0,0,0,0,0,{"$f":"SUMIF($C$8:$C$9441,$C4,CZ$8:CZ$9441)","v":0},0,0,0,0,0,0,0,0,0,{"$f":"SUMIF($C$8:$C$9441,$C4,DJ$8:DJ$9441)","v":0},0,0,0,0,0,0,0,0,0]
[null,null,"Actual",3439.78,3267.8900000000003,3845.34,0,0,0,0,0,0,0,0,0,0,0,0,0,0,0,0,0,0,0,0,0,0,0,0,0,0,0,0,0,0,0,0,0,0,0,0,0,0,0,0,0,0,0,0,0,0,0,0,0,0,0,0,0,0,0,0,0,0,0,0,0,0,0,0,0,0,0,0,0,0,0,0,0,0,0,0,0,0,0,0,0,0,0,0,0,0,0,0,0,0,0,0,0,0,0,0,0,0,0,0,0,0,0,0,0,0,0,0,0,0,0,0,0,0,0,0,0]
[null,"Income Category","Diff.",{"$f":"D5-D4","v":-105.55999999999995},{"$f":"E5-E4","v":-277.44999999999982},300,-3745.34,-3545.34,-3545.34,-3545.34,-3545.34,-3545.34,-3545.34,-3545.34,-3545.34,0,0,0,0,0,0,0,0,0,0,0,0,0,0,0,0,0,0,0,0,0,0,0,0,0,0,0,0,0,0,0,0,0,0,0,0,0,0,0,0,0,0,0,0,0,0,0,0,0,0,0,0,0,{"$f":"BQ5-BQ4","v":0},0,0,0,0,0,0,0,0,0,0,0,0,0,0,0,0,0,0,0,0,0,0,0,0,0,0,0,0,0,0,0,0,0,0,0,0,0,0,0,0,0,0,0,0,0,0,0,0,0,0,0,0,0,0]
[]
[null,"Wages","Plan",3000,3000,3000,3200,3000,3000,3000,3000,3000,3000,3000,3000]
[null,null,"Actual",3000,3000,3000]
[]
[null,"Self employment","Plan",500,500,500,500,500,500,500,500,500,500,500,500]
[null,null,"Actual",394.44,222.55,800]
[]
[null,"Child benefit","Plan",45.34,45.34,45.34,45.34,45.34,45.34,45.34,45.34,45.34,45.34,45.34,45.34]
[null,null,"Actual",45.34,45.34,45.34]
[]
[null,"<another income>","Plan"]
[null,null,"Actual"]
[]
[null,"<another income>","Plan"]
[null,null,"Actual"]
[]
[null,"<another income>","Plan"]
[null,null,"Actual"]
[]
[null,"<another income>","Plan"]
[null,null,"Actual"]
[]
[null,"<another income>","Plan"]
[null,null,"Actual"]
[]
[null,"<another income>","Plan"]
[null,null,"Actual"]
[]
[null,"<another income>","Plan"]
[null,null,"Actual"]
[]
[null,"<another income>","Plan"]
[null,null,"Actual"]
[]
{"$rows_left_out":612}
{"sheet":"Outgoings","index":1,"n_rows":651,"n_cols":123,"rows_kept":651,"cut":false,"hidden":false,"merged":[[649,1,650,1],[634,1,635,1],[637,1,638,1],[640,1,641,1],[643,1,644,1],[646,1,647,1],[619,1,620,1],[622,1,623,1],[625,1,626,1],[628,1,629,1],[631,1,632,1],[604,1,605,1],[607,1,608,1],[610,1,611,1],[613,1,614,1],[616,1,617,1],[589,1,590,1],[592,1,593,1],[595,1,596,1],[598,1,599,1],[601,1,602,1],[574,1,575,1],[577,1,578,1],[580,1,581,1],[583,1,584,1],[586,1,587,1],[559,1,560,1],[562,1,563,1],[565,1,566,1],[568,1,569,1],[571,1,572,1],[544,1,545,1],[547,1,548,1],[550,1,551,1],[553,1,554,1],[556,1,557,1],[529,1,530,1],[532,1,533,1],[535,1,536,1],[538,1,539,1],[541,1,542,1],[514,1,515,1],[517,1,518,1],[520,1,521,1],[523,1,524,1],[526,1,527,1],[499,1,500,1],[502,1,503,1],[505,1,506,1],[508,1,509,1],[511,1,512,1],[484,1,485,1],[487,1,488,1],[490,1,491,1],[493,1,494,1],[496,1,497,1],[469,1,470,1],[472,1,473,1],[475,1,476,1],[478,1,479,1],[481,1,482,1],[454,1,455,1],[457,1,458,1],[460,1,461,1],[463,1,464,1],[466,1,467,1],[439,1,440,1],[442,1,443,1],[445,1,446,1],[448,1,449,1],[451,1,452,1],[424,1,425,1],[427,1,428,1],[430,1,431,1],[433,1,434,1],[436,1,437,1],[409,1,410,1],[412,1,413,1],[415,1,416,1],[418,1,419,1],[421,1,422,1],[394,1,395,1],[397,1,398,1],[400,1,401,1],[403,1,404,1],[406,1,407,1],[379,1,380,1],[382,1,383,1],[385,1,386,1],[388,1,389,1],[391,1,392,1],[364,1,365,1],[367,1,368,1],[370,1,371,1],[373,1,374,1],[376,1,377,1],[349,1,350,1],[352,1,353,1],[355,1,356,1],[358,1,359,1],[361,1,362,1],[334,1,335,1],[337,1,338,1],[340,1,341,1],[343,1,344,1],[346,1,347,1],[319,1,320,1],[322,1,323,1],[325,1,326,1],[328,1,329,1],[331,1,332,1],[304,1,305,1],[307,1,308,1],[310,1,311,1],[313,1,314,1],[316,1,317,1],[289,1,290,1],[292,1,293,1],[295,1,296,1],[298,1,299,1],[301,1,302,1],[274,1,275,1],[277,1,278,1],[280,1,281,1],[283,1,284,1],[286,1,287,1],[259,1,260,1],[262,1,263,1],[265,1,266,1],[268,1,269,1],[271,1,272,1],[244,1,245,1],[247,1,248,1],[250,1,251,1],[253,1,254,1],[256,1,257,1],[229,1,230,1],[232,1,233,1],[235,1,236,1],[238,1,239,1],[241,1,242,1],[214,1,215,1],[217,1,218,1],[220,1,221,1],[223,1,224,1],[226,1,227,1],[22,1,23,1],[202,1,203,1],[205,1,206,1],[208,1,209,1],[211,1,212,1],[94,1,95,1],[61,1,62,1],[64,1,65,1],[67,1,68,1],[70,1,71,1],[73,1,74,1],[76,1,77,1],[79,1,80,1],[82,1,83,1],[85,1,86,1],[88,1,89,1],[91,1,92,1],[130,1,131,1],[97,1,98,1],[7,1,8,1],[10,1,11,1],[13,1,14,1],[16,1,17,1],[19,1,20,1],[58,1,59,1],[25,1,26,1],[28,1,29,1],[31,1,32,1],[34,1,35,1],[37,1,38,1],[40,1,41,1],[43,1,44,1],[46,1,47,1],[49,1,50,1],[52,1,53,1],[55,1,56,1],[109,1,110,1],[112,1,113,1],[181,1,182,1],[184,1,185,1],[151,1,152,1],[154,1,155,1],[157,1,158,1],[160,1,161,1],[163,1,164,1],[166,1,167,1],[187,1,188,1],[190,1,191,1],[193,1,194,1],[196,1,197,1],[199,1,200,1],[5,1,6,1],[169,1,170,1],[172,1,173,1],[175,1,176,1],[178,1,179,1],[133,1,134,1],[136,1,137,1],[139,1,140,1],[142,1,143,1],[145,1,146,1],[148,1,149,1],[115,1,116,1],[118,1,119,1],[121,1,122,1],[124,1,125,1],[127,1,128,1],[100,1,101,1],[103,1,104,1],[106,1,107,1]]}
[null,"Outgoings"]
[null,{"$f":"NOW()","v":"2019-03-13T17:29:37.120"},null,{"$f":"Income!B4","v":"2019-01-01"},{"$f":"DATE(YEAR(D2),MONTH(D2)+1,DAY(D2))","v":"2019-02-01"},{"$f":"DATE(YEAR(E2),MONTH(E2)+1,DAY(E2))","v":"2019-03-01"},"2019-04-01","2019-05-01","2019-06-01","2019-07-01","2019-08-01","2019-09-01","2019-10-01","2019-11-01","2019-12-01","2020-01-01","2020-02-01","2020-03-01","2020-04-01","2020-05-01","2020-06-01","2020-07-01","2020-08-01","2020-09-01","2020-10-01","2020-11-01","2020-12-01","2021-01-01","2021-02-01","2021-03-01","2021-04-01","2021-05-01","2021-06-01","2021-07-01","2021-08-01","2021-09-01","2021-10-01","2021-11-01","2021-12-01","2022-01-01","2022-02-01","2022-03-01","2022-04-01","2022-05-01","2022-06-01","2022-07-01","2022-08-01","2022-09-01","2022-10-01","2022-11-01","2022-12-01","2023-01-01","2023-02-01","2023-03-01","2023-04-01","2023-05-01","2023-06-01","2023-07-01","2023-08-01","2023-09-01","2023-10-01","2023-11-01","2023-12-01","2024-01-01","2024-02-01","2024-03-01","2024-04-01","2024-05-01","2024-06-01",{"$f":"DATE(YEAR(BQ2),MONTH(BQ2)+1,DAY(BQ2))","v":"2024-07-01"},"2024-08-01","2024-09-01","2024-10-01","2024-11-01","2024-12-01","2025-01-01","2025-02-01","2025-03-01","2025-04-01","2025-05-01","2025-06-01","2025-07-01","2025-08-01","2025-09-01","2025-10-01","2025-11-01","2025-12-01","2026-01-01","2026-02-01","2026-03-01","2026-04-01","2026-05-01","2026-06-01","2026-07-01","2026-08-01","2026-09-01","2026-10-01","2026-11-01","2026-12-01","2027-01-01","2027-02-01","2027-03-01","2027-04-01","2027-05-01","2027-06-01","2027-07-01","2027-08-01","2027-09-01","2027-10-01","2027-11-01","2027-12-01","2028-01-01","2028-02-01","2028-03-01","2028-04-01","2028-05-01","2028-06-01","2028-07-01","2028-08-01","2028-09-01","2028-10-01","2028-11-01","2028-12-01"]
[null,null,null,{"$f":"TEXT(D2,\"mmm yy\")","v":"Jan 19"},{"$f":"TEXT(E2,\"mmm yy\")","v":"Feb 19"},{"$f":"TEXT(F2,\"mmm yy\")","v":"Mar 19"},"Apr 19","May 19","Jun 19","Jul 19","Aug 19","Sep 19","Oct 19","Nov 19","Dec 19","Jan 20","Feb 20","Mar 20","Apr 20","May 20","Jun 20","Jul 20","Aug 20","Sep 20","Oct 20","Nov 20","Dec 20","Jan 21","Feb 21","Mar 21","Apr 21","May 21","Jun 21","Jul 21","Aug 21","Sep 21","Oct 21","Nov 21","Dec 21","Jan 22","Feb 22","Mar 22","Apr 22","May 22","Jun 22","Jul 22","Aug 22","Sep 22","Oct 22","Nov 22","Dec 22","Jan 23","Feb 23","Mar 23","Apr 23","May 23","Jun 23","Jul 23","Aug 23","Sep 23","Oct 23","Nov 23","Dec 23","Jan 24","Feb 24","Mar 24","Apr 24","May 24","Jun 24",{"$f":"TEXT(BR2,\"mmm yy\")","v":"Jul 24"},"Aug 24","Sep 24","Oct 24","Nov 24","Dec 24","Jan 25","Feb 25","Mar 25","Apr 25","May 25","Jun 25","Jul 25","Aug 25","Sep 25","Oct 25","Nov 25","Dec 25","Jan 26","Feb 26","Mar 26","Apr 26","May 26","Jun 26","Jul 26","Aug 26","Sep 26","Oct 26","Nov 26","Dec 26","Jan 27","Feb 27","Mar 27","Apr 27","May 27","Jun 27","Jul 27","Aug 27","Sep 27","Oct 27","Nov 27","Dec 27","Jan 28","Feb 28","Mar 28","Apr 28","May 28","Jun 28","Jul 28","Aug 28","Sep 28","Oct 28","Nov 28","Dec 28"]
[null,null,"Plan",{"$f":"SUMIF($C$8:$C$9441,$C4,D$8:D$9441)","v":3545.34},3545.34,4045.34,3545,3545,3545.34,3545.34,3545.34,3545.34,3545.34,{"$f":"SUMIF($C$8:$C$9441,$C4,N$8:N$9441)","v":3545.34},3545.34,0,0,0,0,0,0,0,0,{"$f":"SUMIF($C$8:$C$9441,$C4,X$8:X$9441)","v":0},0,0,0,0,0,0,0,0,0,{"$f":"SUMIF($C$8:$C$9441,$C4,AH$8:AH$9441)","v":0},0,0,0,0,0,0,0,0,0,{"$f":"SUMIF($C$8:$C$9441,$C4,AR$8:AR$9441)","v":0},0,0,0,0,0,0,0,0,0,{"$f":"SUMIF($C$8:$C$9441,$C4,BB$8:BB$9441)","v":0},0,0,0,0,0,0,0,0,0,{"$f":"SUMIF($C$8:$C$9441,$C4,BL$8:BL$9441)","v":0},0,0,0,0,0,0,0,0,0,{"$f":"SUMIF($C$8:$C$9441,$C4,BV$8:BV$9441)","v":0},0,0,0,0,0,0,0,0,0,{"$f":"SUMIF($C$8:$C$9441,$C4,CF$8:CF$9441)","v":0},0,0,0,0,0,0,0,0,0,{"$f":"SUMIF($C$8:$C$9441,$C4,CP$8:CP$9441)","v":0},0,0,0,0,0,0,0,0,0,{"$f":"SUMIF($C$8:$C$9441,$C4,CZ$8:CZ$9441)","v":0},0,0,0,0,0,0,0,0,0,{"$f":"SUMIF($C$8:$C$9441,$C4,DJ$8:DJ$9441)","v":0},0,0,0,0,0,0,0,0,0]
[null,null,"Actual",3538.4199999999996,3537.1,3525.5499999999997,0,0,0,0,0,0,0,0,0,0,0,0,0,0,0,0,0,0,0,0,0,0,0,0,0,0,0,0,0,0,0,0,0,0,0,0,0,0,0,0,0,0,0,0,0,0,0,0,0,0,0,0,0,0,0,0,0,0,0,0,0,0,0,0,0,0,0,0,0,0,0,0,0,0,0,0,0,0,0,0,0,0,0,0,0,0,0,0,0,0,0,0,0,0,0,0,0,0,0,0,0,0,0,0,0,0,0,0,0,0,0,0,0,0,0,0,0]
[null,"Outgoing Category","Diff.",{"$f":"D4-D5","v":6.9200000000005275},{"$f":"E4-E5","v":8.2400000000002365},519.79000000000042,3545,3545,3545.34,3545.34,3545.34,3545.34,3545.34,3545.34,3545.34,0,0,0,0,0,0,0,0,0,0,0,0,0,0,0,0,0,0,0,0,0,0,0,0,0,0,0,0,0,0,0,0,0,0,0,0,0,0,0,0,0,0,0,0,0,0,0,0,0,0,0,0,0,{"$f":"BQ4-BQ5","v":0},0,0,0,0,0,0,0,0,0,0,0,0,0,0,0,0,0,0,0,0,0,0,0,0,0,0,0,0,0,0,0,0,0,0,0,0,0,0,0,0,0,0,0,0,0,0,0,0,0,0,0,0,0,0]
[]
[null,"Mortgage / Rent","Plan",3000,3000,3500,3000,3000,3000,3000,3000,3000,3000,3000,3000]
[null,null,"Actual",2998.89,2998.89,2998.89]
[]
[null,"Home insurance","Plan",500,500,500,500,500,500,500,500,500,500,500,500]
[null,null,"Actual",489.66,489.66,489.66]
[]
[null,"Electricity","Plan",45.34,45.34,45.34,45,45,45.34,45.34,45.34,45.34,45.34,45.34,45.34]
[null,null,"Actual",49.87,48.55,37]
[]
[null,"Gas","Plan"]
[null,null,"Actual"]
[]
[null,"Water","Plan"]
[null,null,"Actual"]
[]
[null,"Phone / Broadband","Plan"]
[null,null,"Actual"]
[]
[null,"Grocery Shopping","Plan"]
[null,null,"Actual"]
[]
[null,"Gifts","Plan"]
[null,null,"Actual"]
[]
[null,"Entertainment","Plan"]
[null,null,"Actual"]
[]
[null,"Transport","Plan"]
[null,null,"Actual"]
[]
[null,"Other","Plan"]
[null,null,"Actual"]
[]
{"$rows_left_out":612}
{"sheet":"Dashboard","index":2,"n_rows":19,"n_cols":17,"rows_kept":19,"cut":false,"hidden":false,"merged":[]}
[]
[null,null,null,null,null,null,null,null,null,null,"Year",2019,null,null,"Year",2019]
[]
["Sum of Value","Column Labels",null,null,null,"Sum of Value","Column Labels",null,null,null,"Sum of Value","Column Labels",null,null,"Sum of Value","Column Labels"]
["Row Labels","Income Actual","Income Plan","Grand Total",null,"Row Labels","Outgoings Plan","Outgoings Actual","Grand Total",null,"Row Labels","Difference","Grand Total",null,"Row Labels","Difference","Grand Total"]
[2019,10553.01,42744.08,53297.089999999982,null,2019,43043.399999999994,10601.07,53644.469999999987,null,"2019-01",-98.639999999999418,-98.639999999999418,null,"2019-01",-98.639999999999418,-98.639999999999418]
[1,3439.78,3545.34,6985.1200000000008,null,1,3545.34,3538.4199999999996,7083.76,null,"2019-02",-269.20999999999958,-269.20999999999958,null,"2019-02",-367.849999999999,-367.849999999999]
[2,3267.8900000000003,3545.34,6813.2300000000005,null,2,3545.34,3537.1,7082.4400000000005,null,"2019-03",319.79000000000042,319.79000000000042,null,"2019-03",-48.059999999998581,-48.059999999998581]
[3,3845.34,3545.34,7390.68,null,3,4045.34,3525.5499999999997,7570.8899999999994,null,"2019-04",200.34000000000015,200.34000000000015,null,"2019-04",152.28000000000156,152.28000000000156]
[4,0,3745.34,3745.34,null,4,3545,0,3545,null,"2019-05",0.34000000000014552,0.34000000000014552,null,"2019-05",152.62000000000171,152.62000000000171]
[5,0,3545.34,3545.34,null,5,3545,0,3545,null,"2019-06",0,0,null,"2019-06",152.62000000000171,152.62000000000171]
[6,0,3545.34,3545.34,null,6,3545.34,0,3545.34,null,"2019-07",0,0,null,"2019-07",152.62000000000171,152.62000000000171]
[7,0,3545.34,3545.34,null,7,3545.34,0,3545.34,null,"2019-08",0,0,null,"2019-08",152.62000000000171,152.62000000000171]
[8,0,3545.34,3545.34,null,8,3545.34,0,3545.34,null,"2019-09",0,0,null,"2019-09",152.62000000000171,152.62000000000171]
[9,0,3545.34,3545.34,null,9,3545.34,0,3545.34,null,"2019-10",0,0,null,"2019-10",152.62000000000171,152.62000000000171]
[10,0,3545.34,3545.34,null,10,3545.34,0,3545.34,null,"2019-11",0,0,null,"2019-11",152.62000000000171,152.62000000000171]
[11,0,3545.34,3545.34,null,11,3545.34,0,3545.34,null,"2019-12",0,0,null,"2019-12",152.62000000000171,152.62000000000171]
[12,0,3545.34,3545.34,null,12,3545.34,0,3545.34,null,"Grand Total",152.62000000000171,152.62000000000171,null,"Grand Total"]
["Grand Total",10553.01,42744.08,53297.089999999982,null,"Grand Total",43043.399999999994,10601.07,53644.469999999987]

{"sheet":"Data","index":3,"n_rows":601,"n_cols":7,"rows_kept":601,"cut":false,"hidden":true,"merged":[]}
["Date","Year","Month","Year Month","MonthText","Type","Value"]
[{"$f":"Income!B4","v":"2019-01-01"},{"$f":"YEAR(A2)","v":2019},{"$f":"MONTH(A2)","v":1},{"$f":"B2&\"-\"&TEXT(C2,\"0#\")","v":"2019-01"},{"$f":"TEXT(A2,\"mmm yy\")","v":"Jan 19"},"Income Plan",{"$f":"HLOOKUP(E2,Income!$3:$5,2,FALSE)","v":3545.34}]
[{"$f":"DATE(YEAR(A2),MONTH(A2)+1,DAY(A2))","v":"2019-02-01"},2019,2,"2019-02",{"$f":"TEXT(A3,\"mmm yy\")","v":"Feb 19"},"Income Plan",{"$f":"HLOOKUP(E3,Income!$3:$5,2,FALSE)","v":3545.34}]
[{"$f":"DATE(YEAR(A3),MONTH(A3)+1,DAY(A3))","v":"2019-03-01"},2019,3,"2019-03","Mar 19","Income Plan",{"$f":"HLOOKUP(E4,Income!$3:$5,2,FALSE)","v":3545.34}]
["2019-04-01",2019,4,"2019-04","Apr 19","Income Plan",{"$f":"HLOOKUP(E5,Income!$3:$5,2,FALSE)","v":3745.34}]
["2019-05-01",2019,5,"2019-05","May 19","Income Plan",{"$f":"HLOOKUP(E6,Income!$3:$5,2,FALSE)","v":3545.34}]
["2019-06-01",2019,6,"2019-06","Jun 19","Income Plan",{"$f":"HLOOKUP(E7,Income!$3:$5,2,FALSE)","v":3545.34}]
["2019-07-01",2019,7,"2019-07","Jul 19","Income Plan",{"$f":"HLOOKUP(E8,Income!$3:$5,2,FALSE)","v":3545.34}]
["2019-08-01",2019,8,"2019-08","Aug 19","Income Plan",{"$f":"HLOOKUP(E9,Income!$3:$5,2,FALSE)","v":3545.34}]
["2019-09-01",2019,9,"2019-09","Sep 19","Income Plan",{"$f":"HLOOKUP(E10,Income!$3:$5,2,FALSE)","v":3545.34}]
["2019-10-01",2019,10,"2019-10","Oct 19","Income Plan",{"$f":"HLOOKUP(E11,Income!$3:$5,2,FALSE)","v":3545.34}]
["2019-11-01",2019,11,"2019-11","Nov 19","Income Plan",{"$f":"HLOOKUP(E12,Income!$3:$5,2,FALSE)","v":3545.34}]
["2019-12-01",2019,12,"2019-12","Dec 19","Income Plan",{"$f":"HLOOKUP(E13,Income!$3:$5,2,FALSE)","v":3545.34}]
["2020-01-01",2020,1,"2020-01","Jan 20","Income Plan",{"$f":"HLOOKUP(E14,Income!$3:$5,2,FALSE)","v":0}]
["2020-02-01",2020,2,"2020-02","Feb 20","Income Plan",{"$f":"HLOOKUP(E15,Income!$3:$5,2,FALSE)","v":0}]
["2020-03-01",2020,3,"2020-03","Mar 20","Income Plan",{"$f":"HLOOKUP(E16,Income!$3:$5,2,FALSE)","v":0}]
["2020-04-01",2020,4,"2020-04","Apr 20","Income Plan",{"$f":"HLOOKUP(E17,Income!$3:$5,2,FALSE)","v":0}]
["2020-05-01",2020,5,"2020-05","May 20","Income Plan",{"$f":"HLOOKUP(E18,Income!$3:$5,2,FALSE)","v":0}]
["2020-06-01",2020,6,"2020-06","Jun 20","Income Plan",{"$f":"HLOOKUP(E19,Income!$3:$5,2,FALSE)","v":0}]
["2020-07-01",2020,7,"2020-07","Jul 20","Income Plan",{"$f":"HLOOKUP(E20,Income!$3:$5,2,FALSE)","v":0}]
["2020-08-01",2020,8,"2020-08","Aug 20","Income Plan",{"$f":"HLOOKUP(E21,Income!$3:$5,2,FALSE)","v":0}]
["2020-09-01",2020,9,"2020-09","Sep 20","Income Plan",{"$f":"HLOOKUP(E22,Income!$3:$5,2,FALSE)","v":0}]
["2020-10-01",2020,10,"2020-10","Oct 20","Income Plan",{"$f":"HLOOKUP(E23,Income!$3:$5,2,FALSE)","v":0}]
["2020-11-01",2020,11,"2020-11","Nov 20","Income Plan",{"$f":"HLOOKUP(E24,Income!$3:$5,2,FALSE)","v":0}]
["2020-12-01",2020,12,"2020-12","Dec 20","Income Plan",{"$f":"HLOOKUP(E25,Income!$3:$5,2,FALSE)","v":0}]
["2021-01-01",2021,1,"2021-01","Jan 21","Income Plan",{"$f":"HLOOKUP(E26,Income!$3:$5,2,FALSE)","v":0}]
["2021-02-01",2021,2,"2021-02","Feb 21","Income Plan",{"$f":"HLOOKUP(E27,Income!$3:$5,2,FALSE)","v":0}]
["2021-03-01",2021,3,"2021-03","Mar 21","Income Plan",{"$f":"HLOOKUP(E28,Income!$3:$5,2,FALSE)","v":0}]
["2021-04-01",2021,4,"2021-04","Apr 21","Income Plan",{"$f":"HLOOKUP(E29,Income!$3:$5,2,FALSE)","v":0}]
["2021-05-01",2021,5,"2021-05","May 21","Income Plan",{"$f":"HLOOKUP(E30,Income!$3:$5,2,FALSE)","v":0}]
["2021-06-01",2021,6,"2021-06","Jun 21","Income Plan",{"$f":"HLOOKUP(E31,Income!$3:$5,2,FALSE)","v":0}]
["2021-07-01",2021,7,"2021-07","Jul 21","Income Plan",{"$f":"HLOOKUP(E32,Income!$3:$5,2,FALSE)","v":0}]
["2021-08-01",2021,8,"2021-08","Aug 21","Income Plan",{"$f":"HLOOKUP(E33,Income!$3:$5,2,FALSE)","v":0}]
["2021-09-01",2021,9,"2021-09","Sep 21","Income Plan",{"$f":"HLOOKUP(E34,Income!$3:$5,2,FALSE)","v":0}]
["2021-10-01",2021,10,"2021-10","Oct 21","Income Plan",{"$f":"HLOOKUP(E35,Income!$3:$5,2,FALSE)","v":0}]
["2021-11-01",2021,11,"2021-11","Nov 21","Income Plan",{"$f":"HLOOKUP(E36,Income!$3:$5,2,FALSE)","v":0}]
["2021-12-01",2021,12,"2021-12","Dec 21","Income Plan",{"$f":"HLOOKUP(E37,Income!$3:$5,2,FALSE)","v":0}]
["2022-01-01",2022,1,"2022-01","Jan 22","Income Plan",{"$f":"HLOOKUP(E38,Income!$3:$5,2,FALSE)","v":0}]
["2022-02-01",2022,2,"2022-02","Feb 22","Income Plan",{"$f":"HLOOKUP(E39,Income!$3:$5,2,FALSE)","v":0}]
["2022-03-01",2022,3,"2022-03","Mar 22","Income Plan",{"$f":"HLOOKUP(E40,Income!$3:$5,2,FALSE)","v":0}]
{"$rows_left_out":562}
{"sheet":"Help","index":4,"n_rows":18,"n_cols":3,"rows_kept":18,"cut":false,"hidden":false,"merged":[]}
[]
[null,null,"Invoice v1.0"]
[]
[]
[]
[null,null,"This free Excel tool was brought to you by:"]
[null,null,"http://www.excel-macros.co.uk/"]
[]
[null,null,"There is a short training video available on YouTube which explains how to use it: "]
[]
[null,null,"https://www.youtube.com/channel/UCvEnfhjNXvtVf9g9pAczbqQ"]
[]
[null,null,"We really hope you enjoy using this tool and get great benefit from it."]
[]
[]
[null,null,"If you need any help or advice please contact us on:"]
[]
[null,null,"Great@Excel-Macros.co.uk"]