{"text_format":"1","workbook":"xlsx","n_sheets":6,"sheets":["Summary","CompanyNames","Locations","Activities","Options","Import"],"not_rendered":{"charts":0,"images":0,"macros":1,"external_links":0,"defined_names":23,"comments":0,"pivot_tables":0},"unopened":[],"bounds":{"document_bytes":16777216,"sheet_cells":100000,"rows_first":2000,"rows_last":500,"rows_between":2000,"halvings":0,"cell_chars":16384,"cell_head_chars":4096},"cells_cut":0,"cells_raw":0,"read":"whole","date_system":"1900"}

{"sheet":"Summary","index":0,"n_rows":13,"n_cols":9,"rows_kept":13,"cut":false,"hidden":false,"merged":[[2,2,2,3]]}
[]
[]
[null,"Company Name",null,null,"Spoken with",null,null,null,"Choose Company"]
[null,"Id",{"$f":"VLOOKUP(C3,Table1[#All],2,FALSE)","v":{"$error":"#N/A"}},null,null,null,null,null,"Show Locations"]
[null,null,null,null,"Summary of discussion",null,null,null,"Get Next Activity"]
[2,{"$f":"Table3[[#Headers],[Phone Number]]","v":"Phone Number"},{"$f":"IFERROR(VLOOKUP(C$4&\"-1\",Locations!D:J,A6,FALSE),VLOOKUP(C$4&\"-\",Locations!D:K,A6,FALSE))","v":{"$error":"#N/A"}}]
[3,{"$f":"Table3[[#Headers],[Address]]","v":"Address"},{"$f":"IFERROR(VLOOKUP(C$4&\"-1\",Locations!D:J,A7,FALSE),VLOOKUP(C$4&\"-\",Locations!D:K,A7,FALSE))","v":{"$error":"#N/A"}},null,"Next steps",null,"Options"]
[4,{"$f":"Table3[[#Headers],[Classification]]","v":"Classification"},{"$f":"IFERROR(VLOOKUP(C$4&\"-1\",Locations!D:J,A8,FALSE),VLOOKUP(C$4&\"-\",Locations!D:K,A8,FALSE))","v":{"$error":"#N/A"}}]
[5,{"$f":"Table3[[#Headers],[Email]]","v":"Email"},{"$f":"IFERROR(VLOOKUP(C$4&\"-1\",Locations!D:J,A9,FALSE),VLOOKUP(C$4&\"-\",Locations!D:K,A9,FALSE))","v":{"$error":"#N/A"}},null,"Next step date (dd/mm/yyyy)",null,"Options"]
[6,{"$f":"Table3[[#Headers],[Website]]","v":"Website"},{"$f":"IFERROR(VLOOKUP(C$4&\"-1\",Locations!D:J,A10,FALSE),VLOOKUP(C$4&\"-\",Locations!D:K,A10,FALSE))","v":{"$error":"#N/A"}}]
[7,{"$f":"Table3[[#Headers],[Location Id]]","v":"Location Id"},{"$f":"IFERROR(VLOOKUP(C$4&\"-1\",Locations!D:J,A11,FALSE),VLOOKUP(C$4&\"-\",Locations!D:K,A11,FALSE))","v":{"$error":"#N/A"}},null,null,null,"Don't contact again"]
[null,"Previous Activities:"]
[null,"Date","Spoken with","Summary of discussion","Next step date","Next steps","Location Id"]

{"sheet":"CompanyNames","index":1,"n_rows":2,"n_cols":4,"rows_kept":2,"cut":false,"hidden":false,"merged":[]}
[" < Back"]
["Company Name","Company Id","Activities","Next Activity"]

{"sheet":"Locations","index":2,"n_rows":2,"n_cols":10,"rows_kept":2,"cut":false,"hidden":false,"merged":[]}
[" < Back"]
["Company Id","Company Name","Primary Location","Primary Lookup","Phone Number","Address","Classification","Email","Website","Location Id"]

{"sheet":"Activities","index":3,"n_rows":2,"n_cols":9,"rows_kept":2,"cut":false,"hidden":false,"merged":[]}
[" < Back"]
["Date","Company Id","Location Id","Company Name","Location Phone","Spoken with","Summary of discussion","Next steps","Next step date"]

{"sheet":"Options","index":4,"n_rows":10,"n_cols":8,"rows_kept":10,"cut":false,"hidden":false,"merged":[]}
[]
[null,"Next Steps Options",null,null,null,"Date Options"]
[]
[null,"Call back","Choose",null,null,"+ 1 day",{"$f":"DATE(YEAR(NOW()),MONTH(NOW()),1+DAY(NOW()))","v":"2019-03-16"},"Choose"]
[null,"Email newsletter","Choose",null,null,"+ 1 week",{"$f":"DATE(YEAR(NOW()),MONTH(NOW()),7+DAY(NOW()))","v":"2019-03-22"},"Choose"]
[null,"Send Coupon","Choose",null,null,"+ 2 weeks",{"$f":"DATE(YEAR(NOW()),MONTH(NOW()),14+DAY(NOW()))","v":"2019-03-29"},"Choose"]
[null,"Visit","Choose",null,null,"+ 1 month",{"$f":"DATE(YEAR(NOW()),1+MONTH(NOW()),DAY(NOW()))","v":"2019-04-15"},"Choose"]
[null,"Run Demo","Choose",null,null,"+ 2 months",{"$f":"DATE(YEAR(NOW()),2+MONTH(NOW()),DAY(NOW()))","v":"2019-05-15"},"Choose"]
[null,"Letter","Choose",null,null,"+ 6 months",{"$f":"DATE(YEAR(NOW()),6+MONTH(NOW()),DAY(NOW()))","v":"2019-09-15"},"Choose"]
[null,null,null,null,null,"+ 1 year",{"$f":"DATE(1+YEAR(NOW()),MONTH(NOW()),DAY(NOW()))","v":"2020-03-15"},"Choose"]

{"sheet":"Import","index":5,"n_rows":1001,"n_cols":6,"rows_kept":1001,"cut":false,"hidden":false,"merged":[]}
["Company Name","Phone Number","Address","Classification","Email","Website"]
["Abata",6993562154,"0 Dennis Pass","Sales",{"$f":"\"fakeemail@\"&F2","v":"fakeemail@stanford.edu"},"stanford.edu"]
["Abatz",2696970598,"313 Eagle Crest Center","Research and Development",{"$f":"\"fakeemail@\"&F3","v":"fakeemail@hp.com"},"hp.com"]
["Abatz",6748517513,"24 Huxley Center","Human Resources","fakeemail@instagram.com","instagram.com"]
["Agimba",7242461931,"5162 Delladonna Hill","Engineering","fakeemail@surveymonkey.com","surveymonkey.com"]
["Agimba",3769455872,"94061 Northview Circle","Research and Development","fakeemail@scientificamerican.com","scientificamerican.com"]
["Agivu",8408102450,"78290 Derek Park","Engineering","fakeemail@free.fr","free.fr"]
["Agivu",1993036395,"3964 Anthes Plaza","Marketing","fakeemail@dyndns.org","dyndns.org"]
["Aibox",5459627852,"28 Northfield Crossing","Engineering","fakeemail@issuu.com","issuu.com"]
["Aibox",2511171398,"52 North Way","Business Development","fakeemail@google.nl","google.nl"]
["Ailane",8886839653,"50878 New Castle Street","Research and Development","fakeemail@themeforest.net","themeforest.net"]
["Aimbo",3983320783,"33787 Canary Point","Marketing","fakeemail@fotki.com","fotki.com"]
["Aimbu",1614962791,"271 Luster Circle","Sales","fakeemail@phoca.cz","phoca.cz"]
["Aimbu",5651959951,"23 Corscot Hill","Services","fakeemail@addtoany.com","addtoany.com"]
["Aimbu",3993185976,"03204 Gulseth Parkway","Business Development","fakeemail@sbwire.com","sbwire.com"]
["Aimbu",1214997443,"35668 Westerfield Crossing","Human Resources","fakeemail@imgur.com","imgur.com"]
["Aimbu",8403242158,"02741 Shopko Street","Sales","fakeemail@acquirethisname.com","acquirethisname.com"]
["Aivee",8599847614,"08133 Eastwood Street","Sales","fakeemail@nba.com","nba.com"]
["Avamba",6206553956,"5 Eagle Crest Alley","Training","fakeemail@examiner.com","examiner.com"]
["Avamba",7971012056,"16307 Bowman Lane","Sales","fakeemail@paypal.com","paypal.com"]
["Avamba",6943093423,"95779 Prairieview Way","Legal","fakeemail@jiathis.com","jiathis.com"]
["Avamm",2108496905,"48 Melby Crossing","Research and Development","fakeemail@washingtonpost.com","washingtonpost.com"]
["Avamm",4875268886,"82172 Trailsway Trail","Services","fakeemail@sogou.com","sogou.com"]
["Avavee",8832454310,"101 Burning Wood Junction","Accounting","fakeemail@fastcompany.com","fastcompany.com"]
["Avavee",9694851570,"531 Stoughton Park","Legal","fakeemail@globo.com","globo.com"]
["Avaveo",3182550268,"13 La Follette Pass","Marketing","fakeemail@addtoany.com","addtoany.com"]
["Avaveo",4234944145,"33964 Transport Place","Engineering","fakeemail@slashdot.org","slashdot.org"]
["Avaveo",6893042188,"0 Lindbergh Parkway","Sales","fakeemail@over-blog.com","over-blog.com"]
["Babbleblab",7107216230,"38 Dexter Pass","Engineering","fakeemail@ameblo.jp","ameblo.jp"]
["Babbleblab",8573372415,"2 Sutteridge Plaza","Human Resources","fakeemail@ucoz.com","ucoz.com"]
["Babbleblab",1045047120,"402 Bartelt Center","Human Resources","fakeemail@berkeley.edu","berkeley.edu"]
["Babbleopia",7324827254,"8 Carberry Hill","Business Development","fakeemail@guardian.co.uk","guardian.co.uk"]
["Babbleopia",2844729531,"04799 Sutteridge Parkway","Accounting","fakeemail@blogspot.com","blogspot.com"]
["Babbleopia",5608842452,"1888 Summerview Trail","Legal","fakeemail@sohu.com","sohu.com"]
["Babbleopia",2109843072,"309 Monument Trail","Engineering","fakeemail@free.fr","free.fr"]
["Babbleopia",7191175030,"3 Loeprich Road","Research and Development","fakeemail@ovh.net","ovh.net"]
["Babbleset",5771184504,"41 Summit Lane","Sales","fakeemail@va.gov","va.gov"]
["Babbleset",1954261036,"854 Tennessee Drive","Business Development","fakeemail@squarespace.com","squarespace.com"]
["Babblestorm",8501880249,"21 Sloan Lane","Sales","fakeemail@who.int","who.int"]
["Blognation",9722554345,"3 Fremont Way","Engineering","fakeemail@taobao.com","taobao.com"]
["Blognation",4614001098,"16632 Pond Parkway","Services","fakeemail@163.com","163.com"]
["Blognation",4499225756,"74 Iowa Center","Human Resources","fakeemail@cbslocal.com","cbslocal.com"]
["Blogpad",8733821296,"88439 Bonner Parkway","Human Resources","fakeemail@microsoft.com","microsoft.com"]
["Blogpad",4907864304,"8237 Mesta Center","Sales","fakeemail@taobao.com","taobao.com"]
["Blogpad",2252356461,"975 Sauthoff Drive","Training","fakeemail@reverbnation.com","reverbnation.com"]
["Blogspan",7764688512,"09 Oneill Junction","Marketing","fakeemail@digg.com","digg.com"]
["Blogspan",9513659983,"7 Mockingbird Crossing","Research and Development","fakeemail@washingtonpost.com","washingtonpost.com"]
["Blogspan",2485553955,"519 Logan Parkway","Sales","fakeemail@home.pl","home.pl"]
["Blogtag",3886795667,"9 Porter Court","Training","fakeemail@desdev.cn","desdev.cn"]
["Blogtags",6032428207,"14876 Westridge Center","Human Resources","fakeemail@shop-pro.jp","shop-pro.jp"]
["Blogtags",4532777534,"8588 Wayridge Court","Marketing","fakeemail@usa.gov","usa.gov"]
["BlogXS",4158478959,"8413 Vidon Point","Product Management","fakeemail@clickbank.net","clickbank.net"]
["BlogXS",8077976257,"96 Dovetail Pass","Human Resources","fakeemail@cmu.edu","cmu.edu"]
["BlogXS",6439361992,"15236 Forest Trail","Legal","fakeemail@npr.org","npr.org"]
["Bluejam",7853145959,"3 Clarendon Park","Product Management","fakeemail@live.com","live.com"]
["Bluejam",1827080857,"408 Lighthouse Bay Alley","Marketing","fakeemail@ed.gov","ed.gov"]
["Bluejam",8607382858,"722 Pleasure Alley","Training","fakeemail@berkeley.edu","berkeley.edu"]
["Bluezoom",5973924145,"63 Caliangt Avenue","Marketing","fakeemail@zimbio.com","zimbio.com"]
["Brainbox",1563026156,"141 Warner Street","Human Resources","fakeemail@sphinn.com","sphinn.com"]
["Brainsphere",6251802784,"91 Maywood Court","Services","fakeemail@sogou.com","sogou.com"]
["Brainverse",7778738400,"66933 Shoshone Parkway","Sales","fakeemail@ft.com","ft.com"]
["Brainverse",3421600417,"3 Bashford Park","Marketing","fakeemail@quantcast.com","quantcast.com"]
["Brainverse",1626451233,"6 Moulton Road","Product Management","fakeemail@cpanel.net","cpanel.net"]
["Brightbean",9751767536,"62 Northport Terrace","Sales","fakeemail@webmd.com","webmd.com"]
["Brightbean",2705262474,"5852 Loeprich Point","Engineering","fakeemail@cam.ac.uk","cam.ac.uk"]
["Brightdog",2036597205,"3181 Tony Place","Human Resources","fakeemail@bloglines.com","bloglines.com"]
["Brightdog",6513383267,"1 Merchant Crossing","Sales",{"$f":"\"fakeemail@\"&F67","v":"fakeemail@psu.edu"},"psu.edu"]
["Brightdog",5494305260,"35361 Rigney Court","Legal","fakeemail@dropbox.com","dropbox.com"]
["Brightdog",1709247320,"611 Rigney Plaza","Engineering","fakeemail@i2i.jp","i2i.jp"]
["Browseblab",9068369279,"9716 Mandrake Way","Human Resources","fakeemail@google.fr","google.fr"]
["Browseblab",5278199052,"284 Boyd Way","Business Development","fakeemail@godaddy.com","godaddy.com"]
["Browseblab",9197972026,"8579 Ohio Street","Legal","fakeemail@github.com","github.com"]
["Browsebug",7223070403,"040 Eliot Place","Research and Development","fakeemail@fema.gov","fema.gov"]
["Browsebug",1499283911,"56166 Bayside Court","Legal","fakeemail@kickstarter.com","kickstarter.com"]
["Browsebug",3601852096,"07 Roxbury Hill","Legal","fakeemail@home.pl","home.pl"]
["Browsecat",5853105886,"5683 Roxbury Pass","Product Management","fakeemail@hhs.gov","hhs.gov"]
["Browsedrive",5558546257,"97603 Beilfuss Street","Product Management","fakeemail@posterous.com","posterous.com"]
["Browsedrive",3211843406,"546 Gulseth Park","Training","fakeemail@ehow.com","ehow.com"]
["Browsetype",4543997328,"391 Lillian Plaza","Research and Development","fakeemail@seesaa.net","seesaa.net"]
["Browsetype",5183389254,"58 Russell Terrace","Engineering","fakeemail@yellowbook.com","yellowbook.com"]
["Browsetype",7815856371,"62580 Knutson Street","Human Resources","fakeemail@wikispaces.com","wikispaces.com"]
["Browsetype",6418092656,"96538 Esker Parkway","Training","fakeemail@wikia.com","wikia.com"]
["Browsezoom",6476947740,"8 Maple Wood Alley","Business Development","fakeemail@usgs.gov","usgs.gov"]
["Browsezoom",6644033003,"58 Hintze Alley","Accounting","fakeemail@deviantart.com","deviantart.com"]
["Browsezoom",4214673012,"681 Texas Junction","Product Management","fakeemail@discovery.com","discovery.com"]
["Bubblebox",1576320621,"5694 Dottie Point","Legal","fakeemail@tiny.cc","tiny.cc"]
["Bubblebox",3933786792,"7 Darwin Junction","Research and Development","fakeemail@privacy.gov.au","privacy.gov.au"]
["Bubblemix",5347224632,"21445 La Follette Circle","Legal","fakeemail@nasa.gov","nasa.gov"]
["Bubblemix",4301262497,"300 Paget Crossing","Research and Development","fakeemail@chron.com","chron.com"]
["Bubbletube",8056768526,"22995 Cherokee Trail","Legal","fakeemail@japanpost.jp","japanpost.jp"]
["Bubbletube",4307296384,"43376 Nevada Lane","Product Management","fakeemail@nbcnews.com","nbcnews.com"]
["Buzzbean",4534579727,"691 Pleasure Terrace","Training","fakeemail@seesaa.net","seesaa.net"]
["Buzzbean",1201643635,"02068 Beilfuss Point","Accounting","fakeemail@sfgate.com","sfgate.com"]
["Buzzbean",6873345584,"7 Graedel Drive","Engineering","fakeemail@joomla.org","joomla.org"]
["Buzzbean",2871503614,"23 Merchant Trail","Sales","fakeemail@newyorker.com","newyorker.com"]
["Buzzbean",9137657262,"3 Schiller Drive","Accounting","fakeemail@ca.gov","ca.gov"]
["Buzzdog",5138447099,"3004 Sheridan Junction","Engineering","fakeemail@cargocollective.com","cargocollective.com"]
["Buzzshare",2741822268,"40812 Aberg Plaza","Human Resources","fakeemail@shareasale.com","shareasale.com"]
["Buzzshare",4015391210,"5345 Hollow Ridge Drive","Human Resources","fakeemail@fema.gov","fema.gov"]
["Buzzshare",7408576876,"286 Aberg Place","Legal","fakeemail@wsj.com","wsj.com"]
["Buzzshare",6475396694,"7009 Mitchell Point","Business Development","fakeemail@patch.com","patch.com"]
["Buzzster",8012617546,"540 Hanover Drive","Support","fakeemail@goodreads.com","goodreads.com"]
["Buzzster",5573869833,"7 Graedel Pass","Marketing","fakeemail@dailymail.co.uk","dailymail.co.uk"]
["Camido",2569890461,"19 Ridgeway Way","Research and Development","fakeemail@opera.com","opera.com"]
["Camido",1345711512,"809 Algoma Lane","Business Development","fakeemail@hugedomains.com","hugedomains.com"]
["Camimbo",8262855689,"7642 Scoville Way","Services","fakeemail@thetimes.co.uk","thetimes.co.uk"]
["Camimbo",2015867760,"5 Lakewood Point","Support","fakeemail@narod.ru","narod.ru"]
["Centidel",1706021215,"66387 Clemons Way","Engineering","fakeemail@webnode.com","webnode.com"]
["Centidel",7018758593,"3 Elka Street","Marketing","fakeemail@gravatar.com","gravatar.com"]
["Centimia",3682879061,"168 Mayfield Circle","Sales","fakeemail@seesaa.net","seesaa.net"]
["Centizu",8036875612,"104 Golden Leaf Point","Support","fakeemail@e-recht24.de","e-recht24.de"]
["Centizu",1552136151,"03 Lien Place","Research and Development","fakeemail@yellowpages.com","yellowpages.com"]
["Chatterbridge",3988764294,"17295 Annamark Park","Product Management","fakeemail@howstuffworks.com","howstuffworks.com"]
["Chatterbridge",7271011194,"73028 Stoughton Alley","Legal","fakeemail@over-blog.com","over-blog.com"]
["Chatterpoint",7191729415,"93124 Laurel Junction","Services","fakeemail@harvard.edu","harvard.edu"]
["Chatterpoint",7348707778,"2 Sauthoff Street","Human Resources","fakeemail@seesaa.net","seesaa.net"]
["Chatterpoint",3325750398,"19 Badeau Crossing","Human Resources","fakeemail@about.me","about.me"]
["Chatterpoint",3656482118,"76 Transport Parkway","Legal","fakeemail@ftc.gov","ftc.gov"]
["Chatterpoint",2114762044,"6213 School Alley","Marketing","fakeemail@phoca.cz","phoca.cz"]
["Chatterpoint",7309357456,"86024 Summerview Center","Research and Development","fakeemail@netvibes.com","netvibes.com"]
["Chatterpoint",8584356491,"3336 Mockingbird Point","Human Resources","fakeemail@google.de","google.de"]
["Cogibox",7211041760,"4402 Pine View Drive","Support","fakeemail@cocolog-nifty.com","cocolog-nifty.com"]
["Cogibox",7351655474,"8 Melody Plaza","Business Development","fakeemail@aol.com","aol.com"]
["Cogibox",1113696893,"9 Dakota Road","Legal","fakeemail@seattletimes.com","seattletimes.com"]
["Cogidoo",3888134606,"36669 Fair Oaks Court","Training","fakeemail@xinhuanet.com","xinhuanet.com"]
["Cogilith",5903554253,"32 Park Meadow Parkway","Engineering","fakeemail@tamu.edu","tamu.edu"]
["Cogilith",2212355294,"2 Memorial Court","Business Development","fakeemail@imdb.com","imdb.com"]
["Cogilith",6718474557,"1432 Garrison Alley","Legal","fakeemail@sciencedaily.com","sciencedaily.com"]
["Dabfeed",2047655470,"31473 Comanche Terrace","Sales","fakeemail@google.ca","google.ca"]
["Dabfeed",3658506863,"373 8th Avenue","Support","fakeemail@sun.com","sun.com"]
["Dabfeed",1554543070,"64564 Shopko Circle","Services",{"$f":"\"fakeemail@\"&F131","v":"fakeemail@cocolog-nifty.com"},"cocolog-nifty.com"]
["Dabjam",5546447880,"828 Darwin Circle","Product Management","fakeemail@wiley.com","wiley.com"]
["Dablist",5373851286,"3 Stuart Center","Engineering","fakeemail@ezinearticles.com","ezinearticles.com"]
["Dablist",7784049221,"6335 Continental Road","Business Development","fakeemail@businesswire.com","businesswire.com"]
["Dablist",7121263016,"3 Morning Court","Marketing","fakeemail@feedburner.com","feedburner.com"]
["Dabshots",3575162406,"70188 Clyde Gallagher Terrace","Business Development","fakeemail@techcrunch.com","techcrunch.com"]
["Dabshots",9361615982,"5220 Service Road","Legal","fakeemail@google.ru","google.ru"]
["Dabtype",7893228344,"6515 Burning Wood Park","Product Management","fakeemail@blogs.com","blogs.com"]
["Dabtype",2462674937,"2 Dawn Crossing","Sales","fakeemail@ask.com","ask.com"]
["Dabtype",5282006044,"97 Schlimgen Circle","Business Development","fakeemail@springer.com","springer.com"]
["Dabtype",4579546103,"50891 Northland Avenue","Product Management","fakeemail@desdev.cn","desdev.cn"]
["Dabtype",2592355917,"401 Loeprich Circle","Product Management","fakeemail@gravatar.com","gravatar.com"]
["Dabtype",1198182097,"9 Eastwood Alley","Research and Development","fakeemail@i2i.jp","i2i.jp"]
["Dabvine",4944747001,"78241 Express Crossing","Training","fakeemail@howstuffworks.com","howstuffworks.com"]
["Dabvine",7976243519,"277 Westerfield Road","Sales","fakeemail@wikipedia.org","wikipedia.org"]
["DabZ",5334431011,"580 Prentice Plaza","Legal","fakeemail@joomla.org","joomla.org"]
["DabZ",2742927873,"4451 Lien Avenue","Product Management","fakeemail@google.com","google.com"]
["Dazzlesphere",8403404143,"792 Garrison Terrace","Legal","fakeemail@t.co","t.co"]
["Dazzlesphere",2476353220,"0 Cordelia Pass","Accounting","fakeemail@free.fr","free.fr"]
["Dazzlesphere",6479884113,"2 Huxley Pass","Training","fakeemail@jiathis.com","jiathis.com"]
["Dazzlesphere",8226573251,"02464 Pearson Street","Human Resources","fakeemail@stanford.edu","stanford.edu"]
["Dazzlesphere",9805623471,"78722 West Place","Services","fakeemail@scribd.com","scribd.com"]
["Dazzlesphere",4527771100,"9914 Ridge Oak Crossing","Engineering","fakeemail@utexas.edu","utexas.edu"]
["Dazzlesphere",6002474800,"1032 Fulton Place","Accounting","fakeemail@gmpg.org","gmpg.org"]
["Demimbu",2512685596,"81 Little Fleur Way","Accounting","fakeemail@a8.net","a8.net"]
["Demivee",5145915199,"88240 Elgar Avenue","Support","fakeemail@seesaa.net","seesaa.net"]
["Demivee",8267296084,"37 Farragut Place","Legal","fakeemail@etsy.com","etsy.com"]
["Demivee",7645468980,"6013 Corscot Place","Training","fakeemail@baidu.com","baidu.com"]
["Demivee",1143381633,"76 Mallory Court","Business Development","fakeemail@earthlink.net","earthlink.net"]
["Demivee",3529608689,"5 New Castle Court","Support","fakeemail@upenn.edu","upenn.edu"]
["Demizz",5553549237,"026 Colorado Lane","Engineering","fakeemail@nyu.edu","nyu.edu"]
["Demizz",7066708669,"9367 Knutson Crossing","Engineering","fakeemail@umn.edu","umn.edu"]
["Devbug",1979845215,"767 Oakridge Plaza","Engineering","fakeemail@intel.com","intel.com"]
["Devbug",3387968223,"49 Norway Maple Junction","Engineering","fakeemail@plala.or.jp","plala.or.jp"]
["Devcast",1487284261,"047 Meadow Valley Plaza","Engineering","fakeemail@google.com.hk","google.com.hk"]
["Devcast",7495758471,"26 Scofield Way","Business Development","fakeemail@sourceforge.net","sourceforge.net"]
["Devcast",1248640248,"2191 Cardinal Center","Support","fakeemail@1688.com","1688.com"]
["Devcast",1553959827,"52835 Waywood Hill","Accounting","fakeemail@sfgate.com","sfgate.com"]
["Devcast",8072750684,"59270 Barby Center","Human Resources","fakeemail@nature.com","nature.com"]
["Devify",4523871787,"4054 Park Meadow Circle","Marketing","fakeemail@theatlantic.com","theatlantic.com"]
["Devify",7143479171,"0569 Summer Ridge Lane","Product Management","fakeemail@washingtonpost.com","washingtonpost.com"]
["Devify",6429430476,"45 Jackson Road","Sales","fakeemail@homestead.com","homestead.com"]
["Devpoint",3777655924,"76 Thierer Pass","Marketing","fakeemail@si.edu","si.edu"]
["Devpoint",3117360146,"6277 North Plaza","Legal","fakeemail@tripod.com","tripod.com"]
["Devpoint",9262861622,"2323 Valley Edge Court","Services","fakeemail@topsy.com","topsy.com"]
["Devpoint",2737690656,"16 Fremont Alley","Accounting","fakeemail@time.com","time.com"]
["Devpulse",9032121393,"528 Morrow Park","Research and Development","fakeemail@cafepress.com","cafepress.com"]
["Devpulse",8571557464,"95 Buell Court","Support","fakeemail@altervista.org","altervista.org"]
["Devshare",1717704903,"9 Troy Lane","Sales","fakeemail@mac.com","mac.com"]
["Digitube",2823869045,"77262 Melody Way","Product Management","fakeemail@istockphoto.com","istockphoto.com"]
["Digitube",8615970987,"1453 Sachtjen Junction","Engineering","fakeemail@thetimes.co.uk","thetimes.co.uk"]
["Digitube",5474063235,"1 Monument Parkway","Human Resources","fakeemail@sciencedirect.com","sciencedirect.com"]
["Divanoodle",5102592669,"7041 Bashford Center","Sales","fakeemail@ameblo.jp","ameblo.jp"]
["Divanoodle",1678405912,"67 Starling Junction","Sales","fakeemail@europa.eu","europa.eu"]
["Divape",6022393359,"2752 Dawn Avenue","Support","fakeemail@stumbleupon.com","stumbleupon.com"]
["Divavu",2668566766,"47 4th Hill","Support","fakeemail@usa.gov","usa.gov"]
["Divavu",8675833876,"9471 Quincy Park","Research and Development","fakeemail@tinyurl.com","tinyurl.com"]
["Divavu",7686463910,"441 Carpenter Parkway","Research and Development","fakeemail@wikipedia.org","wikipedia.org"]
["Dynabox",7992345258,"56 Menomonie Court","Business Development","fakeemail@hibu.com","hibu.com"]
["Dynabox",5466794954,"06970 Lake View Avenue","Marketing","fakeemail@google.co.jp","google.co.jp"]
["Dynabox",2512676699,"72 Browning Road","Product Management","fakeemail@ucla.edu","ucla.edu"]
["Dynabox",8789524235,"47 Monterey Way","Sales","fakeemail@addthis.com","addthis.com"]
["Dynabox",3332749382,"591 Florence Hill","Product Management","fakeemail@ameblo.jp","ameblo.jp"]
["Dynabox",8825610237,"1895 Melby Drive","Product Management","fakeemail@qq.com","qq.com"]
["Dynava",7075943897,"05 Mockingbird Plaza","Services",{"$f":"\"fakeemail@\"&F195","v":"fakeemail@alexa.com"},"alexa.com"]
["Dynava",3914307011,"6 Transport Terrace","Human Resources","fakeemail@hugedomains.com","hugedomains.com"]
["Dynava",3801592191,"779 Dorton Center","Legal","fakeemail@huffingtonpost.com","huffingtonpost.com"]
["Dynazzy",6551451448,"6045 Old Gate Drive","Product Management","fakeemail@storify.com","storify.com"]
["Dynazzy",4064219273,"71728 Saint Paul Plaza","Services","fakeemail@google.com.au","google.com.au"]
["Dynazzy",5114326180,"87224 Dayton Hill","Research and Development","fakeemail@dedecms.com","dedecms.com"]
{"$rows_left_out":801}